source: squid-ssl/trunk/fuentes/libltdl/config.log @ 5495

Last change on this file since 5495 was 5495, checked in by Juanma, 22 months ago

Initial release

File size: 63.5 KB
Line 
1This file contains any messages produced by compilers while
2running configure, to aid debugging if configure makes a mistake.
3
4It was created by libltdl configure 2.4.3a, which was
5generated by GNU Autoconf 2.69.  Invocation command line was
6
7  $ ./configure --disable-option-checking --prefix=/usr --build=x86_64-linux-gnu --includedir=${prefix}/include --mandir=${prefix}/share/man --infodir=${prefix}/share/info --sysconfdir=/etc --localstatedir=/var --libexecdir=${prefix}/lib/squid3 --disable-maintainer-mode --disable-dependency-tracking --disable-silent-rules BUILDCXXFLAGS=-g -O2 -fPIE -fstack-protector-strong -Wformat -Werror=format-security -Wl,-Bsymbolic-functions -fPIE -pie -Wl,-z,relro -Wl,-z,now --program-suffix=-ssl --datadir=/usr/share/squid-ssl --sysconfdir=/etc/squid-ssl --libexecdir=/usr/lib/squid-ssl --mandir=/usr/share/man --enable-inline --disable-arch-native --enable-async-io=8 --enable-storeio=ufs,aufs,diskd,rock --enable-removal-policies=lru,heap --enable-delay-pools --enable-cache-digests --enable-icap-client --enable-follow-x-forwarded-for --enable-auth-basic=DB,fake,getpwnam,LDAP,NCSA,NIS,PAM,POP3,RADIUS,SASL,SMB --enable-auth-digest=file,LDAP --enable-auth-negotiate=kerberos,wrapper --enable-auth-ntlm=fake,smb_lm --enable-external-acl-helpers=file_userip,kerberos_ldap_group,LDAP_group,session,SQL_session,unix_group,wbinfo_group --enable-url-rewrite-helpers=fake --enable-eui --enable-esi --enable-icmp --enable-zph-qos --enable-ecap --enable-ssl-crtd --disable-translation --with-swapdir=/var/spool/squid-ssl --with-logdir=/var/log/squid-ssl --with-pidfile=/var/run/squid-ssl.pid --with-filedescriptors=65536 --with-large-files --with-default-user=proxy --with-openssl --enable-build-info=Ubuntu linux --enable-linux-netfilter build_alias=x86_64-linux-gnu CFLAGS=-g -O2 -fPIE -fstack-protector-strong -Wformat -Werror=format-security -Wall LDFLAGS=-Wl,-Bsymbolic-functions -fPIE -pie -Wl,-z,relro -Wl,-z,now CPPFLAGS=-Wdate-time -D_FORTIFY_SOURCE=2 CXXFLAGS=-g -O2 -fPIE -fstack-protector-strong -Wformat -Werror=format-security --cache-file=/dev/null --srcdir=. --no-create --no-recursion
8
9## --------- ##
10## Platform. ##
11## --------- ##
12
13hostname = h3po4
14uname -m = x86_64
15uname -r = 4.4.0-78-generic
16uname -s = Linux
17uname -v = #99-Ubuntu SMP Thu Apr 27 15:29:09 UTC 2017
18
19/usr/bin/uname -p = unknown
20/bin/uname -X     = unknown
21
22/bin/arch              = unknown
23/usr/bin/arch -k       = unknown
24/usr/convex/getsysinfo = unknown
25/usr/bin/hostinfo      = unknown
26/bin/machine           = unknown
27/usr/bin/oslevel       = unknown
28/bin/universe          = unknown
29
30PATH: /home/juanma/Applications/.bin
31PATH: /usr/bin
32PATH: /usr/local/sbin
33PATH: /usr/local/bin
34PATH: /usr/sbin
35PATH: /usr/bin
36PATH: /sbin
37PATH: /bin
38PATH: /snap/bin
39PATH: /sbin
40
41
42## ----------- ##
43## Core tests. ##
44## ----------- ##
45
46configure:2311: checking for a BSD-compatible install
47configure:2379: result: /usr/bin/install -c
48configure:2390: checking whether build environment is sane
49configure:2445: result: yes
50configure:2596: checking for a thread-safe mkdir -p
51configure:2635: result: /bin/mkdir -p
52configure:2642: checking for gawk
53configure:2658: found /usr/bin/gawk
54configure:2669: result: gawk
55configure:2680: checking whether make sets $(MAKE)
56configure:2702: result: yes
57configure:2731: checking whether make supports nested variables
58configure:2748: result: yes
59configure:2885: checking whether make supports nested variables
60configure:2902: result: yes
61configure:2953: checking build system type
62configure:2967: result: x86_64-pc-linux-gnu
63configure:2987: checking host system type
64configure:3000: result: x86_64-pc-linux-gnu
65configure:3041: checking how to print strings
66configure:3068: result: printf
67configure:3101: checking for style of include used by make
68configure:3129: result: GNU
69configure:3200: checking for gcc
70configure:3216: found /usr/bin/gcc
71configure:3227: result: gcc
72configure:3456: checking for C compiler version
73configure:3465: gcc --version >&5
74gcc (Ubuntu 5.4.0-6ubuntu1~16.04.4) 5.4.0 20160609
75Copyright (C) 2015 Free Software Foundation, Inc.
76This is free software; see the source for copying conditions.  There is NO
77warranty; not even for MERCHANTABILITY or FITNESS FOR A PARTICULAR PURPOSE.
78
79configure:3476: $? = 0
80configure:3465: gcc -v >&5
81Using built-in specs.
82COLLECT_GCC=gcc
83COLLECT_LTO_WRAPPER=/usr/lib/gcc/x86_64-linux-gnu/5/lto-wrapper
84Target: x86_64-linux-gnu
85Configured with: ../src/configure -v --with-pkgversion='Ubuntu 5.4.0-6ubuntu1~16.04.4' --with-bugurl=file:///usr/share/doc/gcc-5/README.Bugs --enable-languages=c,ada,c++,java,go,d,fortran,objc,obj-c++ --prefix=/usr --program-suffix=-5 --enable-shared --enable-linker-build-id --libexecdir=/usr/lib --without-included-gettext --enable-threads=posix --libdir=/usr/lib --enable-nls --with-sysroot=/ --enable-clocale=gnu --enable-libstdcxx-debug --enable-libstdcxx-time=yes --with-default-libstdcxx-abi=new --enable-gnu-unique-object --disable-vtable-verify --enable-libmpx --enable-plugin --with-system-zlib --disable-browser-plugin --enable-java-awt=gtk --enable-gtk-cairo --with-java-home=/usr/lib/jvm/java-1.5.0-gcj-5-amd64/jre --enable-java-home --with-jvm-root-dir=/usr/lib/jvm/java-1.5.0-gcj-5-amd64 --with-jvm-jar-dir=/usr/lib/jvm-exports/java-1.5.0-gcj-5-amd64 --with-arch-directory=amd64 --with-ecj-jar=/usr/share/java/eclipse-ecj.jar --enable-objc-gc --enable-multiarch --disable-werror --with-arch-32=i686 --with-abi=m64 --with-multilib-list=m32,m64,mx32 --enable-multilib --with-tune=generic --enable-checking=release --build=x86_64-linux-gnu --host=x86_64-linux-gnu --target=x86_64-linux-gnu
86Thread model: posix
87gcc version 5.4.0 20160609 (Ubuntu 5.4.0-6ubuntu1~16.04.4)
88configure:3476: $? = 0
89configure:3465: gcc -V >&5
90gcc: error: unrecognized command line option '-V'
91gcc: fatal error: no input files
92compilation terminated.
93configure:3476: $? = 1
94configure:3465: gcc -qversion >&5
95gcc: error: unrecognized command line option '-qversion'
96gcc: fatal error: no input files
97compilation terminated.
98configure:3476: $? = 1
99configure:3496: checking whether the C compiler works
100configure:3518: gcc -g -O2 -fPIE -fstack-protector-strong -Wformat -Werror=format-security -Wall -Wdate-time -D_FORTIFY_SOURCE=2 -Wl,-Bsymbolic-functions -fPIE -pie -Wl,-z,relro -Wl,-z,now conftest.c  >&5
101configure:3522: $? = 0
102configure:3570: result: yes
103configure:3573: checking for C compiler default output file name
104configure:3575: result: a.out
105configure:3581: checking for suffix of executables
106configure:3588: gcc -o conftest -g -O2 -fPIE -fstack-protector-strong -Wformat -Werror=format-security -Wall -Wdate-time -D_FORTIFY_SOURCE=2 -Wl,-Bsymbolic-functions -fPIE -pie -Wl,-z,relro -Wl,-z,now conftest.c  >&5
107configure:3592: $? = 0
108configure:3614: result:
109configure:3636: checking whether we are cross compiling
110configure:3644: gcc -o conftest -g -O2 -fPIE -fstack-protector-strong -Wformat -Werror=format-security -Wall -Wdate-time -D_FORTIFY_SOURCE=2 -Wl,-Bsymbolic-functions -fPIE -pie -Wl,-z,relro -Wl,-z,now conftest.c  >&5
111configure:3648: $? = 0
112configure:3655: ./conftest
113configure:3659: $? = 0
114configure:3674: result: no
115configure:3679: checking for suffix of object files
116configure:3701: gcc -c -g -O2 -fPIE -fstack-protector-strong -Wformat -Werror=format-security -Wall -Wdate-time -D_FORTIFY_SOURCE=2 conftest.c >&5
117configure:3705: $? = 0
118configure:3726: result: o
119configure:3730: checking whether we are using the GNU C compiler
120configure:3749: gcc -c -g -O2 -fPIE -fstack-protector-strong -Wformat -Werror=format-security -Wall -Wdate-time -D_FORTIFY_SOURCE=2 conftest.c >&5
121configure:3749: $? = 0
122configure:3758: result: yes
123configure:3767: checking whether gcc accepts -g
124configure:3787: gcc -c -g -Wdate-time -D_FORTIFY_SOURCE=2 conftest.c >&5
125configure:3787: $? = 0
126configure:3828: result: yes
127configure:3845: checking for gcc option to accept ISO C89
128configure:3908: gcc  -c -g -O2 -fPIE -fstack-protector-strong -Wformat -Werror=format-security -Wall -Wdate-time -D_FORTIFY_SOURCE=2 conftest.c >&5
129configure:3908: $? = 0
130configure:3921: result: none needed
131configure:3946: checking whether gcc understands -c and -o together
132configure:3968: gcc -c conftest.c -o conftest2.o
133configure:3971: $? = 0
134configure:3968: gcc -c conftest.c -o conftest2.o
135configure:3971: $? = 0
136configure:3983: result: yes
137configure:4002: checking dependency style of gcc
138configure:4113: result: none
139configure:4128: checking for a sed that does not truncate output
140configure:4192: result: /bin/sed
141configure:4210: checking for grep that handles long lines and -e
142configure:4268: result: /bin/grep
143configure:4273: checking for egrep
144configure:4335: result: /bin/grep -E
145configure:4340: checking for fgrep
146configure:4402: result: /bin/grep -F
147configure:4437: checking for ld used by gcc
148configure:4504: result: /usr/bin/ld
149configure:4511: checking if the linker (/usr/bin/ld) is GNU ld
150configure:4526: result: yes
151configure:4538: checking for BSD- or MS-compatible name lister (nm)
152configure:4592: result: /usr/bin/nm -B
153configure:4722: checking the name lister (/usr/bin/nm -B) interface
154configure:4729: gcc -c -g -O2 -fPIE -fstack-protector-strong -Wformat -Werror=format-security -Wall -Wdate-time -D_FORTIFY_SOURCE=2 conftest.c >&5
155configure:4732: /usr/bin/nm -B "conftest.o"
156configure:4735: output
1570000000000000000 B some_variable
158configure:4742: result: BSD nm
159configure:4745: checking whether ln -s works
160configure:4749: result: yes
161configure:4757: checking the maximum length of command line arguments
162configure:4888: result: 1572864
163configure:4936: checking how to convert x86_64-pc-linux-gnu file names to x86_64-pc-linux-gnu format
164configure:4976: result: func_convert_file_noop
165configure:4983: checking how to convert x86_64-pc-linux-gnu file names to toolchain format
166configure:5003: result: func_convert_file_noop
167configure:5010: checking for /usr/bin/ld option to reload object files
168configure:5017: result: -r
169configure:5091: checking for objdump
170configure:5107: found /usr/bin/objdump
171configure:5118: result: objdump
172configure:5147: checking how to recognize dependent libraries
173configure:5347: result: pass_all
174configure:5432: checking for dlltool
175configure:5462: result: no
176configure:5489: checking how to associate runtime and link libraries
177configure:5516: result: printf %s\n
178configure:5577: checking for ar
179configure:5593: found /usr/bin/ar
180configure:5604: result: ar
181configure:5641: checking for archiver @FILE support
182configure:5658: gcc -c -g -O2 -fPIE -fstack-protector-strong -Wformat -Werror=format-security -Wall -Wdate-time -D_FORTIFY_SOURCE=2 conftest.c >&5
183configure:5658: $? = 0
184configure:5661: ar cru libconftest.a @conftest.lst >&5
185ar: `u' modifier ignored since `D' is the default (see `U')
186configure:5664: $? = 0
187configure:5669: ar cru libconftest.a @conftest.lst >&5
188ar: `u' modifier ignored since `D' is the default (see `U')
189ar: conftest.o: No such file or directory
190configure:5672: $? = 1
191configure:5684: result: @
192configure:5742: checking for strip
193configure:5758: found /usr/bin/strip
194configure:5769: result: strip
195configure:5841: checking for ranlib
196configure:5857: found /usr/bin/ranlib
197configure:5868: result: ranlib
198configure:5970: checking command to parse /usr/bin/nm -B output from gcc object
199configure:6123: gcc -c -g -O2 -fPIE -fstack-protector-strong -Wformat -Werror=format-security -Wall -Wdate-time -D_FORTIFY_SOURCE=2 conftest.c >&5
200configure:6126: $? = 0
201configure:6130: /usr/bin/nm -B conftest.o \| sed -n -e 's/^.*[ ]\([ABCDGIRSTW][ABCDGIRSTW]*\)[ ][ ]*\([_A-Za-z][_A-Za-z0-9]*\)$/\1 \2 \2/p' | sed '/ __gnu_lto/d' \> conftest.nm
202configure:6133: $? = 0
203configure:6199: gcc -o conftest -g -O2 -fPIE -fstack-protector-strong -Wformat -Werror=format-security -Wall -Wdate-time -D_FORTIFY_SOURCE=2 -Wl,-Bsymbolic-functions -fPIE -pie -Wl,-z,relro -Wl,-z,now conftest.c conftstm.o >&5
204configure:6202: $? = 0
205configure:6240: result: ok
206configure:6287: checking for sysroot
207configure:6317: result: no
208configure:6324: checking for a working dd
209configure:6362: result: /bin/dd
210configure:6366: checking how to truncate binary pipes
211configure:6381: result: /bin/dd bs=4096 count=1
212configure:6517: gcc -c -g -O2 -fPIE -fstack-protector-strong -Wformat -Werror=format-security -Wall -Wdate-time -D_FORTIFY_SOURCE=2 conftest.c >&5
213configure:6520: $? = 0
214configure:6710: checking for mt
215configure:6726: found /bin/mt
216configure:6737: result: mt
217configure:6760: checking if mt is a manifest tool
218configure:6766: mt '-?'
219configure:6774: result: no
220configure:7451: checking how to run the C preprocessor
221configure:7482: gcc -E -Wdate-time -D_FORTIFY_SOURCE=2 conftest.c
222configure:7482: $? = 0
223configure:7496: gcc -E -Wdate-time -D_FORTIFY_SOURCE=2 conftest.c
224conftest.c:11:28: fatal error: ac_nonexistent.h: No such file or directory
225compilation terminated.
226configure:7496: $? = 1
227configure: failed program was:
228| /* confdefs.h */
229| #define PACKAGE_NAME "libltdl"
230| #define PACKAGE_TARNAME "libltdl"
231| #define PACKAGE_VERSION "2.4.3a"
232| #define PACKAGE_STRING "libltdl 2.4.3a"
233| #define PACKAGE_BUGREPORT "bug-libtool@gnu.org"
234| #define PACKAGE_URL ""
235| #define PACKAGE "libltdl"
236| #define VERSION "2.4.3a"
237| /* end confdefs.h.  */
238| #include <ac_nonexistent.h>
239configure:7521: result: gcc -E
240configure:7541: gcc -E -Wdate-time -D_FORTIFY_SOURCE=2 conftest.c
241configure:7541: $? = 0
242configure:7555: gcc -E -Wdate-time -D_FORTIFY_SOURCE=2 conftest.c
243conftest.c:11:28: fatal error: ac_nonexistent.h: No such file or directory
244compilation terminated.
245configure:7555: $? = 1
246configure: failed program was:
247| /* confdefs.h */
248| #define PACKAGE_NAME "libltdl"
249| #define PACKAGE_TARNAME "libltdl"
250| #define PACKAGE_VERSION "2.4.3a"
251| #define PACKAGE_STRING "libltdl 2.4.3a"
252| #define PACKAGE_BUGREPORT "bug-libtool@gnu.org"
253| #define PACKAGE_URL ""
254| #define PACKAGE "libltdl"
255| #define VERSION "2.4.3a"
256| /* end confdefs.h.  */
257| #include <ac_nonexistent.h>
258configure:7584: checking for ANSI C header files
259configure:7604: gcc -c -g -O2 -fPIE -fstack-protector-strong -Wformat -Werror=format-security -Wall -Wdate-time -D_FORTIFY_SOURCE=2 conftest.c >&5
260configure:7604: $? = 0
261configure:7677: gcc -o conftest -g -O2 -fPIE -fstack-protector-strong -Wformat -Werror=format-security -Wall -Wdate-time -D_FORTIFY_SOURCE=2 -Wl,-Bsymbolic-functions -fPIE -pie -Wl,-z,relro -Wl,-z,now conftest.c  >&5
262configure:7677: $? = 0
263configure:7677: ./conftest
264configure:7677: $? = 0
265configure:7688: result: yes
266configure:7701: checking for sys/types.h
267configure:7701: gcc -c -g -O2 -fPIE -fstack-protector-strong -Wformat -Werror=format-security -Wall -Wdate-time -D_FORTIFY_SOURCE=2 conftest.c >&5
268configure:7701: $? = 0
269configure:7701: result: yes
270configure:7701: checking for sys/stat.h
271configure:7701: gcc -c -g -O2 -fPIE -fstack-protector-strong -Wformat -Werror=format-security -Wall -Wdate-time -D_FORTIFY_SOURCE=2 conftest.c >&5
272configure:7701: $? = 0
273configure:7701: result: yes
274configure:7701: checking for stdlib.h
275configure:7701: gcc -c -g -O2 -fPIE -fstack-protector-strong -Wformat -Werror=format-security -Wall -Wdate-time -D_FORTIFY_SOURCE=2 conftest.c >&5
276configure:7701: $? = 0
277configure:7701: result: yes
278configure:7701: checking for string.h
279configure:7701: gcc -c -g -O2 -fPIE -fstack-protector-strong -Wformat -Werror=format-security -Wall -Wdate-time -D_FORTIFY_SOURCE=2 conftest.c >&5
280configure:7701: $? = 0
281configure:7701: result: yes
282configure:7701: checking for memory.h
283configure:7701: gcc -c -g -O2 -fPIE -fstack-protector-strong -Wformat -Werror=format-security -Wall -Wdate-time -D_FORTIFY_SOURCE=2 conftest.c >&5
284configure:7701: $? = 0
285configure:7701: result: yes
286configure:7701: checking for strings.h
287configure:7701: gcc -c -g -O2 -fPIE -fstack-protector-strong -Wformat -Werror=format-security -Wall -Wdate-time -D_FORTIFY_SOURCE=2 conftest.c >&5
288configure:7701: $? = 0
289configure:7701: result: yes
290configure:7701: checking for inttypes.h
291configure:7701: gcc -c -g -O2 -fPIE -fstack-protector-strong -Wformat -Werror=format-security -Wall -Wdate-time -D_FORTIFY_SOURCE=2 conftest.c >&5
292configure:7701: $? = 0
293configure:7701: result: yes
294configure:7701: checking for stdint.h
295configure:7701: gcc -c -g -O2 -fPIE -fstack-protector-strong -Wformat -Werror=format-security -Wall -Wdate-time -D_FORTIFY_SOURCE=2 conftest.c >&5
296configure:7701: $? = 0
297configure:7701: result: yes
298configure:7701: checking for unistd.h
299configure:7701: gcc -c -g -O2 -fPIE -fstack-protector-strong -Wformat -Werror=format-security -Wall -Wdate-time -D_FORTIFY_SOURCE=2 conftest.c >&5
300configure:7701: $? = 0
301configure:7701: result: yes
302configure:7715: checking for dlfcn.h
303configure:7715: gcc -c -g -O2 -fPIE -fstack-protector-strong -Wformat -Werror=format-security -Wall -Wdate-time -D_FORTIFY_SOURCE=2 conftest.c >&5
304configure:7715: $? = 0
305configure:7715: result: yes
306configure:8268: checking for objdir
307configure:8283: result: .libs
308configure:8547: checking if gcc supports -fno-rtti -fno-exceptions
309configure:8565: gcc -c -g -O2 -fPIE -fstack-protector-strong -Wformat -Werror=format-security -Wall -Wdate-time -D_FORTIFY_SOURCE=2 -fno-rtti -fno-exceptions conftest.c >&5
310cc1: warning: command line option '-fno-rtti' is valid for C++/ObjC++ but not for C
311configure:8569: $? = 0
312configure:8582: result: no
313configure:8940: checking for gcc option to produce PIC
314configure:8947: result: -fPIC -DPIC
315configure:8955: checking if gcc PIC flag -fPIC -DPIC works
316configure:8973: gcc -c -g -O2 -fPIE -fstack-protector-strong -Wformat -Werror=format-security -Wall -Wdate-time -D_FORTIFY_SOURCE=2 -fPIC -DPIC -DPIC conftest.c >&5
317configure:8977: $? = 0
318configure:8990: result: yes
319configure:9019: checking if gcc static flag -static works
320configure:9047: result: no
321configure:9062: checking if gcc supports -c -o file.o
322configure:9083: gcc -c -g -O2 -fPIE -fstack-protector-strong -Wformat -Werror=format-security -Wall -Wdate-time -D_FORTIFY_SOURCE=2 -o out/conftest2.o conftest.c >&5
323configure:9087: $? = 0
324configure:9109: result: yes
325configure:9117: checking if gcc supports -c -o file.o
326configure:9164: result: yes
327configure:9197: checking whether the gcc linker (/usr/bin/ld -m elf_x86_64) supports shared libraries
328configure:10460: result: yes
329configure:10497: checking whether -lc should be explicitly linked in
330configure:10505: gcc -c -g -O2 -fPIE -fstack-protector-strong -Wformat -Werror=format-security -Wall -Wdate-time -D_FORTIFY_SOURCE=2 conftest.c >&5
331configure:10508: $? = 0
332configure:10523: gcc -shared  -fPIC -DPIC conftest.o  -v -Wl,-soname -Wl,conftest -o conftest 2\>\&1 \| /bin/grep  -lc  \>/dev/null 2\>\&1
333configure:10526: $? = 0
334configure:10540: result: no
335configure:10700: checking dynamic linker characteristics
336configure:11281: gcc -o conftest -g -O2 -fPIE -fstack-protector-strong -Wformat -Werror=format-security -Wall -Wdate-time -D_FORTIFY_SOURCE=2 -Wl,-Bsymbolic-functions -fPIE -pie -Wl,-z,relro -Wl,-z,now -Wl,-rpath -Wl,/foo conftest.c  >&5
337configure:11281: $? = 0
338configure:11530: result: GNU/Linux ld.so
339configure:11652: checking how to hardcode library paths into programs
340configure:11677: result: immediate
341configure:11779: checking for shl_load
342configure:11779: gcc -o conftest -g -O2 -fPIE -fstack-protector-strong -Wformat -Werror=format-security -Wall -Wdate-time -D_FORTIFY_SOURCE=2 -Wl,-Bsymbolic-functions -fPIE -pie -Wl,-z,relro -Wl,-z,now conftest.c  >&5
343/tmp/cc0foeeL.o: In function `main':
344/media/sdb/svn/xenial/squid-ssl/trunk/fuentes/libltdl/conftest.c:57: undefined reference to `shl_load'
345collect2: error: ld returned 1 exit status
346configure:11779: $? = 1
347configure: failed program was:
348| /* confdefs.h */
349| #define PACKAGE_NAME "libltdl"
350| #define PACKAGE_TARNAME "libltdl"
351| #define PACKAGE_VERSION "2.4.3a"
352| #define PACKAGE_STRING "libltdl 2.4.3a"
353| #define PACKAGE_BUGREPORT "bug-libtool@gnu.org"
354| #define PACKAGE_URL ""
355| #define PACKAGE "libltdl"
356| #define VERSION "2.4.3a"
357| #define STDC_HEADERS 1
358| #define HAVE_SYS_TYPES_H 1
359| #define HAVE_SYS_STAT_H 1
360| #define HAVE_STDLIB_H 1
361| #define HAVE_STRING_H 1
362| #define HAVE_MEMORY_H 1
363| #define HAVE_STRINGS_H 1
364| #define HAVE_INTTYPES_H 1
365| #define HAVE_STDINT_H 1
366| #define HAVE_UNISTD_H 1
367| #define HAVE_DLFCN_H 1
368| #define LT_OBJDIR ".libs/"
369| /* end confdefs.h.  */
370| /* Define shl_load to an innocuous variant, in case <limits.h> declares shl_load.
371|    For example, HP-UX 11i <limits.h> declares gettimeofday.  */
372| #define shl_load innocuous_shl_load
373|
374| /* System header to define __stub macros and hopefully few prototypes,
375|     which can conflict with char shl_load (); below.
376|     Prefer <limits.h> to <assert.h> if __STDC__ is defined, since
377|     <limits.h> exists even on freestanding compilers.  */
378|
379| #ifdef __STDC__
380| # include <limits.h>
381| #else
382| # include <assert.h>
383| #endif
384|
385| #undef shl_load
386|
387| /* Override any GCC internal prototype to avoid an error.
388|    Use char because int might match the return type of a GCC
389|    builtin and then its argument prototype would still apply.  */
390| #ifdef __cplusplus
391| extern "C"
392| #endif
393| char shl_load ();
394| /* The GNU C library defines this for functions which it implements
395|     to always fail with ENOSYS.  Some functions are actually named
396|     something starting with __ and the normal name is an alias.  */
397| #if defined __stub_shl_load || defined __stub___shl_load
398| choke me
399| #endif
400|
401| int
402| main ()
403| {
404| return shl_load ();
405|   ;
406|   return 0;
407| }
408configure:11779: result: no
409configure:11783: checking for shl_load in -ldld
410configure:11808: gcc -o conftest -g -O2 -fPIE -fstack-protector-strong -Wformat -Werror=format-security -Wall -Wdate-time -D_FORTIFY_SOURCE=2 -Wl,-Bsymbolic-functions -fPIE -pie -Wl,-z,relro -Wl,-z,now conftest.c -ldld   >&5
411/usr/bin/ld: cannot find -ldld
412collect2: error: ld returned 1 exit status
413configure:11808: $? = 1
414configure: failed program was:
415| /* confdefs.h */
416| #define PACKAGE_NAME "libltdl"
417| #define PACKAGE_TARNAME "libltdl"
418| #define PACKAGE_VERSION "2.4.3a"
419| #define PACKAGE_STRING "libltdl 2.4.3a"
420| #define PACKAGE_BUGREPORT "bug-libtool@gnu.org"
421| #define PACKAGE_URL ""
422| #define PACKAGE "libltdl"
423| #define VERSION "2.4.3a"
424| #define STDC_HEADERS 1
425| #define HAVE_SYS_TYPES_H 1
426| #define HAVE_SYS_STAT_H 1
427| #define HAVE_STDLIB_H 1
428| #define HAVE_STRING_H 1
429| #define HAVE_MEMORY_H 1
430| #define HAVE_STRINGS_H 1
431| #define HAVE_INTTYPES_H 1
432| #define HAVE_STDINT_H 1
433| #define HAVE_UNISTD_H 1
434| #define HAVE_DLFCN_H 1
435| #define LT_OBJDIR ".libs/"
436| /* end confdefs.h.  */
437|
438| /* Override any GCC internal prototype to avoid an error.
439|    Use char because int might match the return type of a GCC
440|    builtin and then its argument prototype would still apply.  */
441| #ifdef __cplusplus
442| extern "C"
443| #endif
444| char shl_load ();
445| int
446| main ()
447| {
448| return shl_load ();
449|   ;
450|   return 0;
451| }
452configure:11817: result: no
453configure:11822: checking for dlopen
454configure:11822: gcc -o conftest -g -O2 -fPIE -fstack-protector-strong -Wformat -Werror=format-security -Wall -Wdate-time -D_FORTIFY_SOURCE=2 -Wl,-Bsymbolic-functions -fPIE -pie -Wl,-z,relro -Wl,-z,now conftest.c  >&5
455/tmp/cckNESNP.o: In function `main':
456/media/sdb/svn/xenial/squid-ssl/trunk/fuentes/libltdl/conftest.c:57: undefined reference to `dlopen'
457collect2: error: ld returned 1 exit status
458configure:11822: $? = 1
459configure: failed program was:
460| /* confdefs.h */
461| #define PACKAGE_NAME "libltdl"
462| #define PACKAGE_TARNAME "libltdl"
463| #define PACKAGE_VERSION "2.4.3a"
464| #define PACKAGE_STRING "libltdl 2.4.3a"
465| #define PACKAGE_BUGREPORT "bug-libtool@gnu.org"
466| #define PACKAGE_URL ""
467| #define PACKAGE "libltdl"
468| #define VERSION "2.4.3a"
469| #define STDC_HEADERS 1
470| #define HAVE_SYS_TYPES_H 1
471| #define HAVE_SYS_STAT_H 1
472| #define HAVE_STDLIB_H 1
473| #define HAVE_STRING_H 1
474| #define HAVE_MEMORY_H 1
475| #define HAVE_STRINGS_H 1
476| #define HAVE_INTTYPES_H 1
477| #define HAVE_STDINT_H 1
478| #define HAVE_UNISTD_H 1
479| #define HAVE_DLFCN_H 1
480| #define LT_OBJDIR ".libs/"
481| /* end confdefs.h.  */
482| /* Define dlopen to an innocuous variant, in case <limits.h> declares dlopen.
483|    For example, HP-UX 11i <limits.h> declares gettimeofday.  */
484| #define dlopen innocuous_dlopen
485|
486| /* System header to define __stub macros and hopefully few prototypes,
487|     which can conflict with char dlopen (); below.
488|     Prefer <limits.h> to <assert.h> if __STDC__ is defined, since
489|     <limits.h> exists even on freestanding compilers.  */
490|
491| #ifdef __STDC__
492| # include <limits.h>
493| #else
494| # include <assert.h>
495| #endif
496|
497| #undef dlopen
498|
499| /* Override any GCC internal prototype to avoid an error.
500|    Use char because int might match the return type of a GCC
501|    builtin and then its argument prototype would still apply.  */
502| #ifdef __cplusplus
503| extern "C"
504| #endif
505| char dlopen ();
506| /* The GNU C library defines this for functions which it implements
507|     to always fail with ENOSYS.  Some functions are actually named
508|     something starting with __ and the normal name is an alias.  */
509| #if defined __stub_dlopen || defined __stub___dlopen
510| choke me
511| #endif
512|
513| int
514| main ()
515| {
516| return dlopen ();
517|   ;
518|   return 0;
519| }
520configure:11822: result: no
521configure:11826: checking for dlopen in -ldl
522configure:11851: gcc -o conftest -g -O2 -fPIE -fstack-protector-strong -Wformat -Werror=format-security -Wall -Wdate-time -D_FORTIFY_SOURCE=2 -Wl,-Bsymbolic-functions -fPIE -pie -Wl,-z,relro -Wl,-z,now conftest.c -ldl   >&5
523configure:11851: $? = 0
524configure:11860: result: yes
525configure:11979: checking whether a program can dlopen itself
526configure:12059: gcc -o conftest -g -O2 -fPIE -fstack-protector-strong -Wformat -Werror=format-security -Wall -Wdate-time -D_FORTIFY_SOURCE=2 -DHAVE_DLFCN_H -Wl,-Bsymbolic-functions -fPIE -pie -Wl,-z,relro -Wl,-z,now -Wl,--export-dynamic conftest.c -ldl  >&5
527configure:12062: $? = 0
528configure:12080: result: yes
529configure:12085: checking whether a statically linked program can dlopen itself
530configure:12165: gcc -o conftest -g -O2 -fPIE -fstack-protector-strong -Wformat -Werror=format-security -Wall -Wdate-time -D_FORTIFY_SOURCE=2 -DHAVE_DLFCN_H -Wl,-Bsymbolic-functions -fPIE -pie -Wl,-z,relro -Wl,-z,now -Wl,--export-dynamic  conftest.c -ldl  >&5
531configure:12168: $? = 0
532configure:12186: result: yes
533configure:12225: checking whether stripping libraries is possible
534configure:12230: result: yes
535configure:12265: checking if libtool supports shared libraries
536configure:12267: result: yes
537configure:12270: checking whether to build shared libraries
538configure:12295: result: yes
539configure:12298: checking whether to build static libraries
540configure:12302: result: yes
541configure:12339: checking what extension is used for runtime loadable modules
542configure:12351: result: .so
543configure:12375: checking what variable specifies run-time module search path
544configure:12382: result: LD_LIBRARY_PATH
545configure:12392: checking for the default library search path
546configure:12399: result: /lib /usr/lib /usr/lib/x86_64-linux-gnu/libfakeroot /lib/i386-linux-gnu /usr/lib/i386-linux-gnu /lib/i686-linux-gnu /usr/lib/i686-linux-gnu /usr/local/lib /lib/x86_64-linux-gnu /usr/lib/x86_64-linux-gnu /usr/lib/x86_64-linux-gnu/mesa-egl /usr/lib/x86_64-linux-gnu/mesa
547configure:12430: checking for library containing dlopen
548configure:12461: gcc -o conftest -g -O2 -fPIE -fstack-protector-strong -Wformat -Werror=format-security -Wall -Wdate-time -D_FORTIFY_SOURCE=2 -Wl,-Bsymbolic-functions -fPIE -pie -Wl,-z,relro -Wl,-z,now conftest.c  >&5
549/tmp/ccIB8sUZ.o: In function `main':
550/media/sdb/svn/xenial/squid-ssl/trunk/fuentes/libltdl/conftest.c:37: undefined reference to `dlopen'
551collect2: error: ld returned 1 exit status
552configure:12461: $? = 1
553configure: failed program was:
554| /* confdefs.h */
555| #define PACKAGE_NAME "libltdl"
556| #define PACKAGE_TARNAME "libltdl"
557| #define PACKAGE_VERSION "2.4.3a"
558| #define PACKAGE_STRING "libltdl 2.4.3a"
559| #define PACKAGE_BUGREPORT "bug-libtool@gnu.org"
560| #define PACKAGE_URL ""
561| #define PACKAGE "libltdl"
562| #define VERSION "2.4.3a"
563| #define STDC_HEADERS 1
564| #define HAVE_SYS_TYPES_H 1
565| #define HAVE_SYS_STAT_H 1
566| #define HAVE_STDLIB_H 1
567| #define HAVE_STRING_H 1
568| #define HAVE_MEMORY_H 1
569| #define HAVE_STRINGS_H 1
570| #define HAVE_INTTYPES_H 1
571| #define HAVE_STDINT_H 1
572| #define HAVE_UNISTD_H 1
573| #define HAVE_DLFCN_H 1
574| #define LT_OBJDIR ".libs/"
575| #define LT_MODULE_EXT ".so"
576| #define LT_MODULE_PATH_VAR "LD_LIBRARY_PATH"
577| #define LT_DLSEARCH_PATH "/lib:/usr/lib:/usr/lib/x86_64-linux-gnu/libfakeroot:/lib/i386-linux-gnu:/usr/lib/i386-linux-gnu:/lib/i686-linux-gnu:/usr/lib/i686-linux-gnu:/usr/local/lib:/lib/x86_64-linux-gnu:/usr/lib/x86_64-linux-gnu:/usr/lib/x86_64-linux-gnu/mesa-egl:/usr/lib/x86_64-linux-gnu/mesa"
578| /* end confdefs.h.  */
579|
580| /* Override any GCC internal prototype to avoid an error.
581|    Use char because int might match the return type of a GCC
582|    builtin and then its argument prototype would still apply.  */
583| #ifdef __cplusplus
584| extern "C"
585| #endif
586| char dlopen ();
587| int
588| main ()
589| {
590| return dlopen ();
591|   ;
592|   return 0;
593| }
594configure:12461: gcc -o conftest -g -O2 -fPIE -fstack-protector-strong -Wformat -Werror=format-security -Wall -Wdate-time -D_FORTIFY_SOURCE=2 -Wl,-Bsymbolic-functions -fPIE -pie -Wl,-z,relro -Wl,-z,now conftest.c -ldl   >&5
595configure:12461: $? = 0
596configure:12478: result: -ldl
597configure:12568: checking for dlerror
598configure:12568: gcc -o conftest -g -O2 -fPIE -fstack-protector-strong -Wformat -Werror=format-security -Wall -Wdate-time -D_FORTIFY_SOURCE=2 -Wl,-Bsymbolic-functions -fPIE -pie -Wl,-z,relro -Wl,-z,now conftest.c -ldl  -ldl >&5
599configure:12568: $? = 0
600configure:12568: result: yes
601configure:12582: checking for shl_load
602configure:12582: result: no
603configure:12589: checking for shl_load in -ldld
604configure:12623: result: no
605configure:12669: checking for dld_link in -ldld
606configure:12694: gcc -o conftest -g -O2 -fPIE -fstack-protector-strong -Wformat -Werror=format-security -Wall -Wdate-time -D_FORTIFY_SOURCE=2 -Wl,-Bsymbolic-functions -fPIE -pie -Wl,-z,relro -Wl,-z,now conftest.c -ldld  -ldl  >&5
607/usr/bin/ld: cannot find -ldld
608collect2: error: ld returned 1 exit status
609configure:12694: $? = 1
610configure: failed program was:
611| /* confdefs.h */
612| #define PACKAGE_NAME "libltdl"
613| #define PACKAGE_TARNAME "libltdl"
614| #define PACKAGE_VERSION "2.4.3a"
615| #define PACKAGE_STRING "libltdl 2.4.3a"
616| #define PACKAGE_BUGREPORT "bug-libtool@gnu.org"
617| #define PACKAGE_URL ""
618| #define PACKAGE "libltdl"
619| #define VERSION "2.4.3a"
620| #define STDC_HEADERS 1
621| #define HAVE_SYS_TYPES_H 1
622| #define HAVE_SYS_STAT_H 1
623| #define HAVE_STDLIB_H 1
624| #define HAVE_STRING_H 1
625| #define HAVE_MEMORY_H 1
626| #define HAVE_STRINGS_H 1
627| #define HAVE_INTTYPES_H 1
628| #define HAVE_STDINT_H 1
629| #define HAVE_UNISTD_H 1
630| #define HAVE_DLFCN_H 1
631| #define LT_OBJDIR ".libs/"
632| #define LT_MODULE_EXT ".so"
633| #define LT_MODULE_PATH_VAR "LD_LIBRARY_PATH"
634| #define LT_DLSEARCH_PATH "/lib:/usr/lib:/usr/lib/x86_64-linux-gnu/libfakeroot:/lib/i386-linux-gnu:/usr/lib/i386-linux-gnu:/lib/i686-linux-gnu:/usr/lib/i686-linux-gnu:/usr/local/lib:/lib/x86_64-linux-gnu:/usr/lib/x86_64-linux-gnu:/usr/lib/x86_64-linux-gnu/mesa-egl:/usr/lib/x86_64-linux-gnu/mesa"
635| #define HAVE_LIBDL 1
636| #define HAVE_DLERROR 1
637| /* end confdefs.h.  */
638|
639| /* Override any GCC internal prototype to avoid an error.
640|    Use char because int might match the return type of a GCC
641|    builtin and then its argument prototype would still apply.  */
642| #ifdef __cplusplus
643| extern "C"
644| #endif
645| char dld_link ();
646| int
647| main ()
648| {
649| return dld_link ();
650|   ;
651|   return 0;
652| }
653configure:12703: result: no
654configure:12738: checking for _ prefix in compiled symbols
655configure:12748: gcc -c -g -O2 -fPIE -fstack-protector-strong -Wformat -Werror=format-security -Wall -Wdate-time -D_FORTIFY_SOURCE=2 conftest.c >&5
656conftest.c: In function 'main':
657conftest.c:2:12: warning: statement with no effect [-Wunused-value]
658 int main(){nm_test_func;return 0;}
659            ^
660configure:12751: $? = 0
661configure:12755: /usr/bin/nm -B conftest.o \| sed -n -e 's/^.*[  ]\([ABCDGIRSTW][ABCDGIRSTW]*\)[         ][      ]*\([_A-Za-z][_A-Za-z0-9]*\)$/\1 \2 \2/p' | sed '/ __gnu_lto/d' \> conftest.nm
662configure:12758: $? = 0
663configure:12780: result: no
664configure:12897: checking whether deplibs are loaded by dlopen
665configure:12994: result: yes
666configure:13005: checking for argz.h
667configure:13005: gcc -c -g -O2 -fPIE -fstack-protector-strong -Wformat -Werror=format-security -Wall -Wdate-time -D_FORTIFY_SOURCE=2 conftest.c >&5
668configure:13005: $? = 0
669configure:13005: result: yes
670configure:13017: checking for error_t
671configure:13017: gcc -c -g -O2 -fPIE -fstack-protector-strong -Wformat -Werror=format-security -Wall -Wdate-time -D_FORTIFY_SOURCE=2 conftest.c >&5
672configure:13017: $? = 0
673configure:13017: gcc -c -g -O2 -fPIE -fstack-protector-strong -Wformat -Werror=format-security -Wall -Wdate-time -D_FORTIFY_SOURCE=2 conftest.c >&5
674conftest.c: In function 'main':
675conftest.c:37:22: error: expected expression before ')' token
676 if (sizeof ((error_t)))
677                      ^
678configure:13017: $? = 1
679configure: failed program was:
680| /* confdefs.h */
681| #define PACKAGE_NAME "libltdl"
682| #define PACKAGE_TARNAME "libltdl"
683| #define PACKAGE_VERSION "2.4.3a"
684| #define PACKAGE_STRING "libltdl 2.4.3a"
685| #define PACKAGE_BUGREPORT "bug-libtool@gnu.org"
686| #define PACKAGE_URL ""
687| #define PACKAGE "libltdl"
688| #define VERSION "2.4.3a"
689| #define STDC_HEADERS 1
690| #define HAVE_SYS_TYPES_H 1
691| #define HAVE_SYS_STAT_H 1
692| #define HAVE_STDLIB_H 1
693| #define HAVE_STRING_H 1
694| #define HAVE_MEMORY_H 1
695| #define HAVE_STRINGS_H 1
696| #define HAVE_INTTYPES_H 1
697| #define HAVE_STDINT_H 1
698| #define HAVE_UNISTD_H 1
699| #define HAVE_DLFCN_H 1
700| #define LT_OBJDIR ".libs/"
701| #define LT_MODULE_EXT ".so"
702| #define LT_MODULE_PATH_VAR "LD_LIBRARY_PATH"
703| #define LT_DLSEARCH_PATH "/lib:/usr/lib:/usr/lib/x86_64-linux-gnu/libfakeroot:/lib/i386-linux-gnu:/usr/lib/i386-linux-gnu:/lib/i686-linux-gnu:/usr/lib/i686-linux-gnu:/usr/local/lib:/lib/x86_64-linux-gnu:/usr/lib/x86_64-linux-gnu:/usr/lib/x86_64-linux-gnu/mesa-egl:/usr/lib/x86_64-linux-gnu/mesa"
704| #define HAVE_LIBDL 1
705| #define HAVE_DLERROR 1
706| #define HAVE_LIBDLLOADER 1
707| #define HAVE_ARGZ_H 1
708| /* end confdefs.h.  */
709| #if defined(HAVE_ARGZ_H)
710| #  include <argz.h>
711| #endif
712|
713| int
714| main ()
715| {
716| if (sizeof ((error_t)))
717|           return 0;
718|   ;
719|   return 0;
720| }
721configure:13017: result: yes
722configure:13043: checking for argz_add
723configure:13043: gcc -o conftest -g -O2 -fPIE -fstack-protector-strong -Wformat -Werror=format-security -Wall -Wdate-time -D_FORTIFY_SOURCE=2 -Wl,-Bsymbolic-functions -fPIE -pie -Wl,-z,relro -Wl,-z,now conftest.c  >&5
724configure:13043: $? = 0
725configure:13043: result: yes
726configure:13043: checking for argz_append
727configure:13043: gcc -o conftest -g -O2 -fPIE -fstack-protector-strong -Wformat -Werror=format-security -Wall -Wdate-time -D_FORTIFY_SOURCE=2 -Wl,-Bsymbolic-functions -fPIE -pie -Wl,-z,relro -Wl,-z,now conftest.c  >&5
728configure:13043: $? = 0
729configure:13043: result: yes
730configure:13043: checking for argz_count
731configure:13043: gcc -o conftest -g -O2 -fPIE -fstack-protector-strong -Wformat -Werror=format-security -Wall -Wdate-time -D_FORTIFY_SOURCE=2 -Wl,-Bsymbolic-functions -fPIE -pie -Wl,-z,relro -Wl,-z,now conftest.c  >&5
732configure:13043: $? = 0
733configure:13043: result: yes
734configure:13043: checking for argz_create_sep
735configure:13043: gcc -o conftest -g -O2 -fPIE -fstack-protector-strong -Wformat -Werror=format-security -Wall -Wdate-time -D_FORTIFY_SOURCE=2 -Wl,-Bsymbolic-functions -fPIE -pie -Wl,-z,relro -Wl,-z,now conftest.c  >&5
736configure:13043: $? = 0
737configure:13043: result: yes
738configure:13043: checking for argz_insert
739configure:13043: gcc -o conftest -g -O2 -fPIE -fstack-protector-strong -Wformat -Werror=format-security -Wall -Wdate-time -D_FORTIFY_SOURCE=2 -Wl,-Bsymbolic-functions -fPIE -pie -Wl,-z,relro -Wl,-z,now conftest.c  >&5
740configure:13043: $? = 0
741configure:13043: result: yes
742configure:13043: checking for argz_next
743configure:13043: gcc -o conftest -g -O2 -fPIE -fstack-protector-strong -Wformat -Werror=format-security -Wall -Wdate-time -D_FORTIFY_SOURCE=2 -Wl,-Bsymbolic-functions -fPIE -pie -Wl,-z,relro -Wl,-z,now conftest.c  >&5
744configure:13043: $? = 0
745configure:13043: result: yes
746configure:13043: checking for argz_stringify
747configure:13043: gcc -o conftest -g -O2 -fPIE -fstack-protector-strong -Wformat -Werror=format-security -Wall -Wdate-time -D_FORTIFY_SOURCE=2 -Wl,-Bsymbolic-functions -fPIE -pie -Wl,-z,relro -Wl,-z,now conftest.c  >&5
748configure:13043: $? = 0
749configure:13043: result: yes
750configure:13061: checking if argz actually works
751configure:13092: result: yes
752configure:13111: checking whether libtool supports -dlopen/-dlpreopen
753configure:13123: result: yes
754configure:13176: checking for unistd.h
755configure:13176: result: yes
756configure:13176: checking for dl.h
757configure:13176: gcc -c -g -O2 -fPIE -fstack-protector-strong -Wformat -Werror=format-security -Wall -Wdate-time -D_FORTIFY_SOURCE=2 conftest.c >&5
758conftest.c:75:16: fatal error: dl.h: No such file or directory
759compilation terminated.
760configure:13176: $? = 1
761configure: failed program was:
762| /* confdefs.h */
763| #define PACKAGE_NAME "libltdl"
764| #define PACKAGE_TARNAME "libltdl"
765| #define PACKAGE_VERSION "2.4.3a"
766| #define PACKAGE_STRING "libltdl 2.4.3a"
767| #define PACKAGE_BUGREPORT "bug-libtool@gnu.org"
768| #define PACKAGE_URL ""
769| #define PACKAGE "libltdl"
770| #define VERSION "2.4.3a"
771| #define STDC_HEADERS 1
772| #define HAVE_SYS_TYPES_H 1
773| #define HAVE_SYS_STAT_H 1
774| #define HAVE_STDLIB_H 1
775| #define HAVE_STRING_H 1
776| #define HAVE_MEMORY_H 1
777| #define HAVE_STRINGS_H 1
778| #define HAVE_INTTYPES_H 1
779| #define HAVE_STDINT_H 1
780| #define HAVE_UNISTD_H 1
781| #define HAVE_DLFCN_H 1
782| #define LT_OBJDIR ".libs/"
783| #define LT_MODULE_EXT ".so"
784| #define LT_MODULE_PATH_VAR "LD_LIBRARY_PATH"
785| #define LT_DLSEARCH_PATH "/lib:/usr/lib:/usr/lib/x86_64-linux-gnu/libfakeroot:/lib/i386-linux-gnu:/usr/lib/i386-linux-gnu:/lib/i686-linux-gnu:/usr/lib/i686-linux-gnu:/usr/local/lib:/lib/x86_64-linux-gnu:/usr/lib/x86_64-linux-gnu:/usr/lib/x86_64-linux-gnu/mesa-egl:/usr/lib/x86_64-linux-gnu/mesa"
786| #define HAVE_LIBDL 1
787| #define HAVE_DLERROR 1
788| #define HAVE_LIBDLLOADER 1
789| #define HAVE_ARGZ_H 1
790| #define HAVE_ERROR_T 1
791| #define HAVE_ARGZ_ADD 1
792| #define HAVE_ARGZ_APPEND 1
793| #define HAVE_ARGZ_COUNT 1
794| #define HAVE_ARGZ_CREATE_SEP 1
795| #define HAVE_ARGZ_INSERT 1
796| #define HAVE_ARGZ_NEXT 1
797| #define HAVE_ARGZ_STRINGIFY 1
798| #define HAVE_WORKING_ARGZ 1
799| #define HAVE_PRELOADED_SYMBOLS 1
800| #define HAVE_UNISTD_H 1
801| /* end confdefs.h.  */
802| #include <stdio.h>
803| #ifdef HAVE_SYS_TYPES_H
804| # include <sys/types.h>
805| #endif
806| #ifdef HAVE_SYS_STAT_H
807| # include <sys/stat.h>
808| #endif
809| #ifdef STDC_HEADERS
810| # include <stdlib.h>
811| # include <stddef.h>
812| #else
813| # ifdef HAVE_STDLIB_H
814| #  include <stdlib.h>
815| # endif
816| #endif
817| #ifdef HAVE_STRING_H
818| # if !defined STDC_HEADERS && defined HAVE_MEMORY_H
819| #  include <memory.h>
820| # endif
821| # include <string.h>
822| #endif
823| #ifdef HAVE_STRINGS_H
824| # include <strings.h>
825| #endif
826| #ifdef HAVE_INTTYPES_H
827| # include <inttypes.h>
828| #endif
829| #ifdef HAVE_STDINT_H
830| # include <stdint.h>
831| #endif
832| #ifdef HAVE_UNISTD_H
833| # include <unistd.h>
834| #endif
835|
836| #include <dl.h>
837configure:13176: result: no
838configure:13176: checking for sys/dl.h
839configure:13176: gcc -c -g -O2 -fPIE -fstack-protector-strong -Wformat -Werror=format-security -Wall -Wdate-time -D_FORTIFY_SOURCE=2 conftest.c >&5
840conftest.c:75:20: fatal error: sys/dl.h: No such file or directory
841compilation terminated.
842configure:13176: $? = 1
843configure: failed program was:
844| /* confdefs.h */
845| #define PACKAGE_NAME "libltdl"
846| #define PACKAGE_TARNAME "libltdl"
847| #define PACKAGE_VERSION "2.4.3a"
848| #define PACKAGE_STRING "libltdl 2.4.3a"
849| #define PACKAGE_BUGREPORT "bug-libtool@gnu.org"
850| #define PACKAGE_URL ""
851| #define PACKAGE "libltdl"
852| #define VERSION "2.4.3a"
853| #define STDC_HEADERS 1
854| #define HAVE_SYS_TYPES_H 1
855| #define HAVE_SYS_STAT_H 1
856| #define HAVE_STDLIB_H 1
857| #define HAVE_STRING_H 1
858| #define HAVE_MEMORY_H 1
859| #define HAVE_STRINGS_H 1
860| #define HAVE_INTTYPES_H 1
861| #define HAVE_STDINT_H 1
862| #define HAVE_UNISTD_H 1
863| #define HAVE_DLFCN_H 1
864| #define LT_OBJDIR ".libs/"
865| #define LT_MODULE_EXT ".so"
866| #define LT_MODULE_PATH_VAR "LD_LIBRARY_PATH"
867| #define LT_DLSEARCH_PATH "/lib:/usr/lib:/usr/lib/x86_64-linux-gnu/libfakeroot:/lib/i386-linux-gnu:/usr/lib/i386-linux-gnu:/lib/i686-linux-gnu:/usr/lib/i686-linux-gnu:/usr/local/lib:/lib/x86_64-linux-gnu:/usr/lib/x86_64-linux-gnu:/usr/lib/x86_64-linux-gnu/mesa-egl:/usr/lib/x86_64-linux-gnu/mesa"
868| #define HAVE_LIBDL 1
869| #define HAVE_DLERROR 1
870| #define HAVE_LIBDLLOADER 1
871| #define HAVE_ARGZ_H 1
872| #define HAVE_ERROR_T 1
873| #define HAVE_ARGZ_ADD 1
874| #define HAVE_ARGZ_APPEND 1
875| #define HAVE_ARGZ_COUNT 1
876| #define HAVE_ARGZ_CREATE_SEP 1
877| #define HAVE_ARGZ_INSERT 1
878| #define HAVE_ARGZ_NEXT 1
879| #define HAVE_ARGZ_STRINGIFY 1
880| #define HAVE_WORKING_ARGZ 1
881| #define HAVE_PRELOADED_SYMBOLS 1
882| #define HAVE_UNISTD_H 1
883| /* end confdefs.h.  */
884| #include <stdio.h>
885| #ifdef HAVE_SYS_TYPES_H
886| # include <sys/types.h>
887| #endif
888| #ifdef HAVE_SYS_STAT_H
889| # include <sys/stat.h>
890| #endif
891| #ifdef STDC_HEADERS
892| # include <stdlib.h>
893| # include <stddef.h>
894| #else
895| # ifdef HAVE_STDLIB_H
896| #  include <stdlib.h>
897| # endif
898| #endif
899| #ifdef HAVE_STRING_H
900| # if !defined STDC_HEADERS && defined HAVE_MEMORY_H
901| #  include <memory.h>
902| # endif
903| # include <string.h>
904| #endif
905| #ifdef HAVE_STRINGS_H
906| # include <strings.h>
907| #endif
908| #ifdef HAVE_INTTYPES_H
909| # include <inttypes.h>
910| #endif
911| #ifdef HAVE_STDINT_H
912| # include <stdint.h>
913| #endif
914| #ifdef HAVE_UNISTD_H
915| # include <unistd.h>
916| #endif
917|
918| #include <sys/dl.h>
919configure:13176: result: no
920configure:13176: checking for dld.h
921configure:13176: gcc -c -g -O2 -fPIE -fstack-protector-strong -Wformat -Werror=format-security -Wall -Wdate-time -D_FORTIFY_SOURCE=2 conftest.c >&5
922conftest.c:75:17: fatal error: dld.h: No such file or directory
923compilation terminated.
924configure:13176: $? = 1
925configure: failed program was:
926| /* confdefs.h */
927| #define PACKAGE_NAME "libltdl"
928| #define PACKAGE_TARNAME "libltdl"
929| #define PACKAGE_VERSION "2.4.3a"
930| #define PACKAGE_STRING "libltdl 2.4.3a"
931| #define PACKAGE_BUGREPORT "bug-libtool@gnu.org"
932| #define PACKAGE_URL ""
933| #define PACKAGE "libltdl"
934| #define VERSION "2.4.3a"
935| #define STDC_HEADERS 1
936| #define HAVE_SYS_TYPES_H 1
937| #define HAVE_SYS_STAT_H 1
938| #define HAVE_STDLIB_H 1
939| #define HAVE_STRING_H 1
940| #define HAVE_MEMORY_H 1
941| #define HAVE_STRINGS_H 1
942| #define HAVE_INTTYPES_H 1
943| #define HAVE_STDINT_H 1
944| #define HAVE_UNISTD_H 1
945| #define HAVE_DLFCN_H 1
946| #define LT_OBJDIR ".libs/"
947| #define LT_MODULE_EXT ".so"
948| #define LT_MODULE_PATH_VAR "LD_LIBRARY_PATH"
949| #define LT_DLSEARCH_PATH "/lib:/usr/lib:/usr/lib/x86_64-linux-gnu/libfakeroot:/lib/i386-linux-gnu:/usr/lib/i386-linux-gnu:/lib/i686-linux-gnu:/usr/lib/i686-linux-gnu:/usr/local/lib:/lib/x86_64-linux-gnu:/usr/lib/x86_64-linux-gnu:/usr/lib/x86_64-linux-gnu/mesa-egl:/usr/lib/x86_64-linux-gnu/mesa"
950| #define HAVE_LIBDL 1
951| #define HAVE_DLERROR 1
952| #define HAVE_LIBDLLOADER 1
953| #define HAVE_ARGZ_H 1
954| #define HAVE_ERROR_T 1
955| #define HAVE_ARGZ_ADD 1
956| #define HAVE_ARGZ_APPEND 1
957| #define HAVE_ARGZ_COUNT 1
958| #define HAVE_ARGZ_CREATE_SEP 1
959| #define HAVE_ARGZ_INSERT 1
960| #define HAVE_ARGZ_NEXT 1
961| #define HAVE_ARGZ_STRINGIFY 1
962| #define HAVE_WORKING_ARGZ 1
963| #define HAVE_PRELOADED_SYMBOLS 1
964| #define HAVE_UNISTD_H 1
965| /* end confdefs.h.  */
966| #include <stdio.h>
967| #ifdef HAVE_SYS_TYPES_H
968| # include <sys/types.h>
969| #endif
970| #ifdef HAVE_SYS_STAT_H
971| # include <sys/stat.h>
972| #endif
973| #ifdef STDC_HEADERS
974| # include <stdlib.h>
975| # include <stddef.h>
976| #else
977| # ifdef HAVE_STDLIB_H
978| #  include <stdlib.h>
979| # endif
980| #endif
981| #ifdef HAVE_STRING_H
982| # if !defined STDC_HEADERS && defined HAVE_MEMORY_H
983| #  include <memory.h>
984| # endif
985| # include <string.h>
986| #endif
987| #ifdef HAVE_STRINGS_H
988| # include <strings.h>
989| #endif
990| #ifdef HAVE_INTTYPES_H
991| # include <inttypes.h>
992| #endif
993| #ifdef HAVE_STDINT_H
994| # include <stdint.h>
995| #endif
996| #ifdef HAVE_UNISTD_H
997| # include <unistd.h>
998| #endif
999|
1000| #include <dld.h>
1001configure:13176: result: no
1002configure:13176: checking for mach-o/dyld.h
1003configure:13176: gcc -c -g -O2 -fPIE -fstack-protector-strong -Wformat -Werror=format-security -Wall -Wdate-time -D_FORTIFY_SOURCE=2 conftest.c >&5
1004conftest.c:75:25: fatal error: mach-o/dyld.h: No such file or directory
1005compilation terminated.
1006configure:13176: $? = 1
1007configure: failed program was:
1008| /* confdefs.h */
1009| #define PACKAGE_NAME "libltdl"
1010| #define PACKAGE_TARNAME "libltdl"
1011| #define PACKAGE_VERSION "2.4.3a"
1012| #define PACKAGE_STRING "libltdl 2.4.3a"
1013| #define PACKAGE_BUGREPORT "bug-libtool@gnu.org"
1014| #define PACKAGE_URL ""
1015| #define PACKAGE "libltdl"
1016| #define VERSION "2.4.3a"
1017| #define STDC_HEADERS 1
1018| #define HAVE_SYS_TYPES_H 1
1019| #define HAVE_SYS_STAT_H 1
1020| #define HAVE_STDLIB_H 1
1021| #define HAVE_STRING_H 1
1022| #define HAVE_MEMORY_H 1
1023| #define HAVE_STRINGS_H 1
1024| #define HAVE_INTTYPES_H 1
1025| #define HAVE_STDINT_H 1
1026| #define HAVE_UNISTD_H 1
1027| #define HAVE_DLFCN_H 1
1028| #define LT_OBJDIR ".libs/"
1029| #define LT_MODULE_EXT ".so"
1030| #define LT_MODULE_PATH_VAR "LD_LIBRARY_PATH"
1031| #define LT_DLSEARCH_PATH "/lib:/usr/lib:/usr/lib/x86_64-linux-gnu/libfakeroot:/lib/i386-linux-gnu:/usr/lib/i386-linux-gnu:/lib/i686-linux-gnu:/usr/lib/i686-linux-gnu:/usr/local/lib:/lib/x86_64-linux-gnu:/usr/lib/x86_64-linux-gnu:/usr/lib/x86_64-linux-gnu/mesa-egl:/usr/lib/x86_64-linux-gnu/mesa"
1032| #define HAVE_LIBDL 1
1033| #define HAVE_DLERROR 1
1034| #define HAVE_LIBDLLOADER 1
1035| #define HAVE_ARGZ_H 1
1036| #define HAVE_ERROR_T 1
1037| #define HAVE_ARGZ_ADD 1
1038| #define HAVE_ARGZ_APPEND 1
1039| #define HAVE_ARGZ_COUNT 1
1040| #define HAVE_ARGZ_CREATE_SEP 1
1041| #define HAVE_ARGZ_INSERT 1
1042| #define HAVE_ARGZ_NEXT 1
1043| #define HAVE_ARGZ_STRINGIFY 1
1044| #define HAVE_WORKING_ARGZ 1
1045| #define HAVE_PRELOADED_SYMBOLS 1
1046| #define HAVE_UNISTD_H 1
1047| /* end confdefs.h.  */
1048| #include <stdio.h>
1049| #ifdef HAVE_SYS_TYPES_H
1050| # include <sys/types.h>
1051| #endif
1052| #ifdef HAVE_SYS_STAT_H
1053| # include <sys/stat.h>
1054| #endif
1055| #ifdef STDC_HEADERS
1056| # include <stdlib.h>
1057| # include <stddef.h>
1058| #else
1059| # ifdef HAVE_STDLIB_H
1060| #  include <stdlib.h>
1061| # endif
1062| #endif
1063| #ifdef HAVE_STRING_H
1064| # if !defined STDC_HEADERS && defined HAVE_MEMORY_H
1065| #  include <memory.h>
1066| # endif
1067| # include <string.h>
1068| #endif
1069| #ifdef HAVE_STRINGS_H
1070| # include <strings.h>
1071| #endif
1072| #ifdef HAVE_INTTYPES_H
1073| # include <inttypes.h>
1074| #endif
1075| #ifdef HAVE_STDINT_H
1076| # include <stdint.h>
1077| #endif
1078| #ifdef HAVE_UNISTD_H
1079| # include <unistd.h>
1080| #endif
1081|
1082| #include <mach-o/dyld.h>
1083configure:13176: result: no
1084configure:13176: checking for dirent.h
1085configure:13176: gcc -c -g -O2 -fPIE -fstack-protector-strong -Wformat -Werror=format-security -Wall -Wdate-time -D_FORTIFY_SOURCE=2 conftest.c >&5
1086configure:13176: $? = 0
1087configure:13176: result: yes
1088configure:13191: checking for closedir
1089configure:13191: gcc -o conftest -g -O2 -fPIE -fstack-protector-strong -Wformat -Werror=format-security -Wall -Wdate-time -D_FORTIFY_SOURCE=2 -Wl,-Bsymbolic-functions -fPIE -pie -Wl,-z,relro -Wl,-z,now conftest.c  >&5
1090configure:13191: $? = 0
1091configure:13191: result: yes
1092configure:13191: checking for opendir
1093configure:13191: gcc -o conftest -g -O2 -fPIE -fstack-protector-strong -Wformat -Werror=format-security -Wall -Wdate-time -D_FORTIFY_SOURCE=2 -Wl,-Bsymbolic-functions -fPIE -pie -Wl,-z,relro -Wl,-z,now conftest.c  >&5
1094configure:13191: $? = 0
1095configure:13191: result: yes
1096configure:13191: checking for readdir
1097configure:13191: gcc -o conftest -g -O2 -fPIE -fstack-protector-strong -Wformat -Werror=format-security -Wall -Wdate-time -D_FORTIFY_SOURCE=2 -Wl,-Bsymbolic-functions -fPIE -pie -Wl,-z,relro -Wl,-z,now conftest.c  >&5
1098configure:13191: $? = 0
1099configure:13191: result: yes
1100configure:13210: checking for strlcat
1101configure:13210: gcc -o conftest -g -O2 -fPIE -fstack-protector-strong -Wformat -Werror=format-security -Wall -Wdate-time -D_FORTIFY_SOURCE=2 -Wl,-Bsymbolic-functions -fPIE -pie -Wl,-z,relro -Wl,-z,now conftest.c  >&5
1102/tmp/ccFugvlI.o: In function `main':
1103/media/sdb/svn/xenial/squid-ssl/trunk/fuentes/libltdl/conftest.c:79: undefined reference to `strlcat'
1104collect2: error: ld returned 1 exit status
1105configure:13210: $? = 1
1106configure: failed program was:
1107| /* confdefs.h */
1108| #define PACKAGE_NAME "libltdl"
1109| #define PACKAGE_TARNAME "libltdl"
1110| #define PACKAGE_VERSION "2.4.3a"
1111| #define PACKAGE_STRING "libltdl 2.4.3a"
1112| #define PACKAGE_BUGREPORT "bug-libtool@gnu.org"
1113| #define PACKAGE_URL ""
1114| #define PACKAGE "libltdl"
1115| #define VERSION "2.4.3a"
1116| #define STDC_HEADERS 1
1117| #define HAVE_SYS_TYPES_H 1
1118| #define HAVE_SYS_STAT_H 1
1119| #define HAVE_STDLIB_H 1
1120| #define HAVE_STRING_H 1
1121| #define HAVE_MEMORY_H 1
1122| #define HAVE_STRINGS_H 1
1123| #define HAVE_INTTYPES_H 1
1124| #define HAVE_STDINT_H 1
1125| #define HAVE_UNISTD_H 1
1126| #define HAVE_DLFCN_H 1
1127| #define LT_OBJDIR ".libs/"
1128| #define LT_MODULE_EXT ".so"
1129| #define LT_MODULE_PATH_VAR "LD_LIBRARY_PATH"
1130| #define LT_DLSEARCH_PATH "/lib:/usr/lib:/usr/lib/x86_64-linux-gnu/libfakeroot:/lib/i386-linux-gnu:/usr/lib/i386-linux-gnu:/lib/i686-linux-gnu:/usr/lib/i686-linux-gnu:/usr/local/lib:/lib/x86_64-linux-gnu:/usr/lib/x86_64-linux-gnu:/usr/lib/x86_64-linux-gnu/mesa-egl:/usr/lib/x86_64-linux-gnu/mesa"
1131| #define HAVE_LIBDL 1
1132| #define HAVE_DLERROR 1
1133| #define HAVE_LIBDLLOADER 1
1134| #define HAVE_ARGZ_H 1
1135| #define HAVE_ERROR_T 1
1136| #define HAVE_ARGZ_ADD 1
1137| #define HAVE_ARGZ_APPEND 1
1138| #define HAVE_ARGZ_COUNT 1
1139| #define HAVE_ARGZ_CREATE_SEP 1
1140| #define HAVE_ARGZ_INSERT 1
1141| #define HAVE_ARGZ_NEXT 1
1142| #define HAVE_ARGZ_STRINGIFY 1
1143| #define HAVE_WORKING_ARGZ 1
1144| #define HAVE_PRELOADED_SYMBOLS 1
1145| #define HAVE_UNISTD_H 1
1146| #define HAVE_DIRENT_H 1
1147| #define HAVE_CLOSEDIR 1
1148| #define HAVE_OPENDIR 1
1149| #define HAVE_READDIR 1
1150| /* end confdefs.h.  */
1151| /* Define strlcat to an innocuous variant, in case <limits.h> declares strlcat.
1152|    For example, HP-UX 11i <limits.h> declares gettimeofday.  */
1153| #define strlcat innocuous_strlcat
1154|
1155| /* System header to define __stub macros and hopefully few prototypes,
1156|     which can conflict with char strlcat (); below.
1157|     Prefer <limits.h> to <assert.h> if __STDC__ is defined, since
1158|     <limits.h> exists even on freestanding compilers.  */
1159|
1160| #ifdef __STDC__
1161| # include <limits.h>
1162| #else
1163| # include <assert.h>
1164| #endif
1165|
1166| #undef strlcat
1167|
1168| /* Override any GCC internal prototype to avoid an error.
1169|    Use char because int might match the return type of a GCC
1170|    builtin and then its argument prototype would still apply.  */
1171| #ifdef __cplusplus
1172| extern "C"
1173| #endif
1174| char strlcat ();
1175| /* The GNU C library defines this for functions which it implements
1176|     to always fail with ENOSYS.  Some functions are actually named
1177|     something starting with __ and the normal name is an alias.  */
1178| #if defined __stub_strlcat || defined __stub___strlcat
1179| choke me
1180| #endif
1181|
1182| int
1183| main ()
1184| {
1185| return strlcat ();
1186|   ;
1187|   return 0;
1188| }
1189configure:13210: result: no
1190configure:13210: checking for strlcpy
1191configure:13210: gcc -o conftest -g -O2 -fPIE -fstack-protector-strong -Wformat -Werror=format-security -Wall -Wdate-time -D_FORTIFY_SOURCE=2 -Wl,-Bsymbolic-functions -fPIE -pie -Wl,-z,relro -Wl,-z,now conftest.c  >&5
1192/tmp/cclzY5NK.o: In function `main':
1193/media/sdb/svn/xenial/squid-ssl/trunk/fuentes/libltdl/conftest.c:79: undefined reference to `strlcpy'
1194collect2: error: ld returned 1 exit status
1195configure:13210: $? = 1
1196configure: failed program was:
1197| /* confdefs.h */
1198| #define PACKAGE_NAME "libltdl"
1199| #define PACKAGE_TARNAME "libltdl"
1200| #define PACKAGE_VERSION "2.4.3a"
1201| #define PACKAGE_STRING "libltdl 2.4.3a"
1202| #define PACKAGE_BUGREPORT "bug-libtool@gnu.org"
1203| #define PACKAGE_URL ""
1204| #define PACKAGE "libltdl"
1205| #define VERSION "2.4.3a"
1206| #define STDC_HEADERS 1
1207| #define HAVE_SYS_TYPES_H 1
1208| #define HAVE_SYS_STAT_H 1
1209| #define HAVE_STDLIB_H 1
1210| #define HAVE_STRING_H 1
1211| #define HAVE_MEMORY_H 1
1212| #define HAVE_STRINGS_H 1
1213| #define HAVE_INTTYPES_H 1
1214| #define HAVE_STDINT_H 1
1215| #define HAVE_UNISTD_H 1
1216| #define HAVE_DLFCN_H 1
1217| #define LT_OBJDIR ".libs/"
1218| #define LT_MODULE_EXT ".so"
1219| #define LT_MODULE_PATH_VAR "LD_LIBRARY_PATH"
1220| #define LT_DLSEARCH_PATH "/lib:/usr/lib:/usr/lib/x86_64-linux-gnu/libfakeroot:/lib/i386-linux-gnu:/usr/lib/i386-linux-gnu:/lib/i686-linux-gnu:/usr/lib/i686-linux-gnu:/usr/local/lib:/lib/x86_64-linux-gnu:/usr/lib/x86_64-linux-gnu:/usr/lib/x86_64-linux-gnu/mesa-egl:/usr/lib/x86_64-linux-gnu/mesa"
1221| #define HAVE_LIBDL 1
1222| #define HAVE_DLERROR 1
1223| #define HAVE_LIBDLLOADER 1
1224| #define HAVE_ARGZ_H 1
1225| #define HAVE_ERROR_T 1
1226| #define HAVE_ARGZ_ADD 1
1227| #define HAVE_ARGZ_APPEND 1
1228| #define HAVE_ARGZ_COUNT 1
1229| #define HAVE_ARGZ_CREATE_SEP 1
1230| #define HAVE_ARGZ_INSERT 1
1231| #define HAVE_ARGZ_NEXT 1
1232| #define HAVE_ARGZ_STRINGIFY 1
1233| #define HAVE_WORKING_ARGZ 1
1234| #define HAVE_PRELOADED_SYMBOLS 1
1235| #define HAVE_UNISTD_H 1
1236| #define HAVE_DIRENT_H 1
1237| #define HAVE_CLOSEDIR 1
1238| #define HAVE_OPENDIR 1
1239| #define HAVE_READDIR 1
1240| /* end confdefs.h.  */
1241| /* Define strlcpy to an innocuous variant, in case <limits.h> declares strlcpy.
1242|    For example, HP-UX 11i <limits.h> declares gettimeofday.  */
1243| #define strlcpy innocuous_strlcpy
1244|
1245| /* System header to define __stub macros and hopefully few prototypes,
1246|     which can conflict with char strlcpy (); below.
1247|     Prefer <limits.h> to <assert.h> if __STDC__ is defined, since
1248|     <limits.h> exists even on freestanding compilers.  */
1249|
1250| #ifdef __STDC__
1251| # include <limits.h>
1252| #else
1253| # include <assert.h>
1254| #endif
1255|
1256| #undef strlcpy
1257|
1258| /* Override any GCC internal prototype to avoid an error.
1259|    Use char because int might match the return type of a GCC
1260|    builtin and then its argument prototype would still apply.  */
1261| #ifdef __cplusplus
1262| extern "C"
1263| #endif
1264| char strlcpy ();
1265| /* The GNU C library defines this for functions which it implements
1266|     to always fail with ENOSYS.  Some functions are actually named
1267|     something starting with __ and the normal name is an alias.  */
1268| #if defined __stub_strlcpy || defined __stub___strlcpy
1269| choke me
1270| #endif
1271|
1272| int
1273| main ()
1274| {
1275| return strlcpy ();
1276|   ;
1277|   return 0;
1278| }
1279configure:13210: result: no
1280configure:13361: checking that generated files are newer than configure
1281configure:13367: result: done
1282configure:13399: creating ./config.status
1283
1284## ---------------- ##
1285## Cache variables. ##
1286## ---------------- ##
1287
1288ac_cv_build=x86_64-pc-linux-gnu
1289ac_cv_c_compiler_gnu=yes
1290ac_cv_env_CC_set=
1291ac_cv_env_CC_value=
1292ac_cv_env_CFLAGS_set=set
1293ac_cv_env_CFLAGS_value='-g -O2 -fPIE -fstack-protector-strong -Wformat -Werror=format-security -Wall'
1294ac_cv_env_CPPFLAGS_set=set
1295ac_cv_env_CPPFLAGS_value='-Wdate-time -D_FORTIFY_SOURCE=2'
1296ac_cv_env_CPP_set=
1297ac_cv_env_CPP_value=
1298ac_cv_env_LDFLAGS_set=set
1299ac_cv_env_LDFLAGS_value='-Wl,-Bsymbolic-functions -fPIE -pie -Wl,-z,relro -Wl,-z,now'
1300ac_cv_env_LIBS_set=
1301ac_cv_env_LIBS_value=
1302ac_cv_env_LT_SYS_LIBRARY_PATH_set=
1303ac_cv_env_LT_SYS_LIBRARY_PATH_value=
1304ac_cv_env_build_alias_set=set
1305ac_cv_env_build_alias_value=x86_64-linux-gnu
1306ac_cv_env_host_alias_set=
1307ac_cv_env_host_alias_value=
1308ac_cv_env_target_alias_set=
1309ac_cv_env_target_alias_value=
1310ac_cv_func_argz_add=yes
1311ac_cv_func_argz_append=yes
1312ac_cv_func_argz_count=yes
1313ac_cv_func_argz_create_sep=yes
1314ac_cv_func_argz_insert=yes
1315ac_cv_func_argz_next=yes
1316ac_cv_func_argz_stringify=yes
1317ac_cv_func_closedir=yes
1318ac_cv_func_dlerror=yes
1319ac_cv_func_dlopen=no
1320ac_cv_func_opendir=yes
1321ac_cv_func_readdir=yes
1322ac_cv_func_shl_load=no
1323ac_cv_func_strlcat=no
1324ac_cv_func_strlcpy=no
1325ac_cv_header_argz_h=yes
1326ac_cv_header_dirent_h=yes
1327ac_cv_header_dl_h=no
1328ac_cv_header_dld_h=no
1329ac_cv_header_dlfcn_h=yes
1330ac_cv_header_inttypes_h=yes
1331ac_cv_header_mach_o_dyld_h=no
1332ac_cv_header_memory_h=yes
1333ac_cv_header_stdc=yes
1334ac_cv_header_stdint_h=yes
1335ac_cv_header_stdlib_h=yes
1336ac_cv_header_string_h=yes
1337ac_cv_header_strings_h=yes
1338ac_cv_header_sys_dl_h=no
1339ac_cv_header_sys_stat_h=yes
1340ac_cv_header_sys_types_h=yes
1341ac_cv_header_unistd_h=yes
1342ac_cv_host=x86_64-pc-linux-gnu
1343ac_cv_lib_dl_dlopen=yes
1344ac_cv_lib_dld_dld_link=no
1345ac_cv_lib_dld_shl_load=no
1346ac_cv_objext=o
1347ac_cv_path_EGREP='/bin/grep -E'
1348ac_cv_path_FGREP='/bin/grep -F'
1349ac_cv_path_GREP=/bin/grep
1350ac_cv_path_SED=/bin/sed
1351ac_cv_path_install='/usr/bin/install -c'
1352ac_cv_path_lt_DD=/bin/dd
1353ac_cv_path_mkdir=/bin/mkdir
1354ac_cv_prog_AWK=gawk
1355ac_cv_prog_CPP='gcc -E'
1356ac_cv_prog_ac_ct_AR=ar
1357ac_cv_prog_ac_ct_CC=gcc
1358ac_cv_prog_ac_ct_MANIFEST_TOOL=mt
1359ac_cv_prog_ac_ct_OBJDUMP=objdump
1360ac_cv_prog_ac_ct_RANLIB=ranlib
1361ac_cv_prog_ac_ct_STRIP=strip
1362ac_cv_prog_cc_c89=
1363ac_cv_prog_cc_g=yes
1364ac_cv_prog_make_make_set=yes
1365ac_cv_search_dlopen=-ldl
1366ac_cv_type_error_t=yes
1367am_cv_CC_dependencies_compiler_type=none
1368am_cv_make_support_nested_variables=yes
1369am_cv_prog_cc_c_o=yes
1370libltdl_cv_lib_dl_dlopen=yes
1371libltdl_cv_preloaded_symbols=yes
1372libltdl_cv_shlibext=.so
1373libltdl_cv_shrext=.so
1374lt_cv_ar_at_file=@
1375lt_cv_archive_cmds_need_lc=no
1376lt_cv_deplibs_check_method=pass_all
1377lt_cv_dlopen=dlopen
1378lt_cv_dlopen_libs=-ldl
1379lt_cv_dlopen_self=yes
1380lt_cv_dlopen_self_static=yes
1381lt_cv_file_magic_cmd='$MAGIC_CMD'
1382lt_cv_file_magic_test_file=
1383lt_cv_ld_reload_flag=-r
1384lt_cv_module_path_var=LD_LIBRARY_PATH
1385lt_cv_nm_interface='BSD nm'
1386lt_cv_objdir=.libs
1387lt_cv_path_LD=/usr/bin/ld
1388lt_cv_path_NM='/usr/bin/nm -B'
1389lt_cv_path_mainfest_tool=no
1390lt_cv_prog_compiler_c_o=yes
1391lt_cv_prog_compiler_pic='-fPIC -DPIC'
1392lt_cv_prog_compiler_pic_works=yes
1393lt_cv_prog_compiler_rtti_exceptions=no
1394lt_cv_prog_compiler_static_works=no
1395lt_cv_prog_gnu_ld=yes
1396lt_cv_sharedlib_from_linklib_cmd='printf %s\n'
1397lt_cv_shlibpath_overrides_runpath=no
1398lt_cv_sys_argz_works=yes
1399lt_cv_sys_dlopen_deplibs=yes
1400lt_cv_sys_dlsearch_path='/lib /usr/lib /usr/lib/x86_64-linux-gnu/libfakeroot /lib/i386-linux-gnu /usr/lib/i386-linux-gnu /lib/i686-linux-gnu /usr/lib/i686-linux-gnu /usr/local/lib /lib/x86_64-linux-gnu /usr/lib/x86_64-linux-gnu /usr/lib/x86_64-linux-gnu/mesa-egl /usr/lib/x86_64-linux-gnu/mesa '
1401lt_cv_sys_global_symbol_pipe='sed -n -e '\''s/^.*[       ]\([ABCDGIRSTW][ABCDGIRSTW]*\)[         ][      ]*\([_A-Za-z][_A-Za-z0-9]*\)$/\1 \2 \2/p'\'' | sed '\''/ __gnu_lto/d'\'''
1402lt_cv_sys_global_symbol_to_c_name_address='sed -n -e '\''s/^: \(.*\) .*$/  {"\1", (void *) 0},/p'\'' -e '\''s/^[ABCDGIRSTW][ABCDGIRSTW]* .* \(.*\)$/  {"\1", (void *) \&\1},/p'\'''
1403lt_cv_sys_global_symbol_to_c_name_address_lib_prefix='sed -n -e '\''s/^: \(.*\) .*$/  {"\1", (void *) 0},/p'\'' -e '\''s/^[ABCDGIRSTW][ABCDGIRSTW]* .* \(lib.*\)$/  {"\1", (void *) \&\1},/p'\'' -e '\''s/^[ABCDGIRSTW][ABCDGIRSTW]* .* \(.*\)$/  {"lib\1", (void *) \&\1},/p'\'''
1404lt_cv_sys_global_symbol_to_cdecl='sed -n -e '\''s/^T .* \(.*\)$/extern int \1();/p'\'' -e '\''s/^[ABCDGIRSTW][ABCDGIRSTW]* .* \(.*\)$/extern char \1;/p'\'''
1405lt_cv_sys_global_symbol_to_import=
1406lt_cv_sys_max_cmd_len=1572864
1407lt_cv_sys_symbol_underscore=no
1408lt_cv_to_host_file_cmd=func_convert_file_noop
1409lt_cv_to_tool_file_cmd=func_convert_file_noop
1410lt_cv_truncate_bin='/bin/dd bs=4096 count=1'
1411
1412## ----------------- ##
1413## Output variables. ##
1414## ----------------- ##
1415
1416ACLOCAL='${SHELL} /media/sdb/svn/xenial/squid-ssl/trunk/fuentes/cfgaux/missing aclocal-1.15'
1417AMDEPBACKSLASH=''
1418AMDEP_FALSE=''
1419AMDEP_TRUE='#'
1420AMTAR='$${TAR-tar}'
1421AM_BACKSLASH='\'
1422AM_DEFAULT_V='$(AM_DEFAULT_VERBOSITY)'
1423AM_DEFAULT_VERBOSITY='1'
1424AM_V='$(V)'
1425AR='ar'
1426AS='as'
1427AUTOCONF='${SHELL} /media/sdb/svn/xenial/squid-ssl/trunk/fuentes/cfgaux/missing autoconf'
1428AUTOHEADER='${SHELL} /media/sdb/svn/xenial/squid-ssl/trunk/fuentes/cfgaux/missing autoheader'
1429AUTOMAKE='${SHELL} /media/sdb/svn/xenial/squid-ssl/trunk/fuentes/cfgaux/missing automake-1.15'
1430AWK='gawk'
1431CC='gcc'
1432CCDEPMODE='depmode=none'
1433CFLAGS='-g -O2 -fPIE -fstack-protector-strong -Wformat -Werror=format-security -Wall'
1434CONVENIENCE_LTDL_FALSE='#'
1435CONVENIENCE_LTDL_TRUE=''
1436CPP='gcc -E'
1437CPPFLAGS='-Wdate-time -D_FORTIFY_SOURCE=2'
1438CYGPATH_W='echo'
1439DEFS='-DHAVE_CONFIG_H'
1440DEPDIR='.deps'
1441DLLTOOL='false'
1442DSYMUTIL=''
1443DUMPBIN=''
1444ECHO_C=''
1445ECHO_N='-n'
1446ECHO_T=''
1447EGREP='/bin/grep -E'
1448EXEEXT=''
1449FGREP='/bin/grep -F'
1450GREP='/bin/grep'
1451INSTALL_DATA='${INSTALL} -m 644'
1452INSTALL_LTDL_FALSE=''
1453INSTALL_LTDL_TRUE='#'
1454INSTALL_PROGRAM='${INSTALL}'
1455INSTALL_SCRIPT='${INSTALL}'
1456INSTALL_STRIP_PROGRAM='$(install_sh) -c -s'
1457LD='/usr/bin/ld -m elf_x86_64'
1458LDFLAGS='-Wl,-Bsymbolic-functions -fPIE -pie -Wl,-z,relro -Wl,-z,now'
1459LIBADD_DL='-ldl '
1460LIBADD_DLD_LINK=''
1461LIBADD_DLOPEN='-ldl'
1462LIBADD_SHL_LOAD=''
1463LIBOBJS=' ${LIBOBJDIR}lt__strl$U.o'
1464LIBS=''
1465LIBTOOL='$(SHELL) $(top_builddir)/libtool'
1466LIPO=''
1467LN_S='ln -s'
1468LTDLOPEN='libltdl'
1469LTLIBOBJS=' ${LIBOBJDIR}lt__strl$U.lo'
1470LT_ARGZ_H=''
1471LT_CONFIG_H='config.h'
1472LT_DLLOADERS=' dlopen.la'
1473LT_DLPREOPEN='-dlpreopen dlopen.la '
1474LT_SYS_LIBRARY_PATH=''
1475MAKEINFO='${SHELL} /media/sdb/svn/xenial/squid-ssl/trunk/fuentes/cfgaux/missing makeinfo'
1476MANIFEST_TOOL=':'
1477MKDIR_P='/bin/mkdir -p'
1478NM='/usr/bin/nm -B'
1479NMEDIT=''
1480OBJDUMP='objdump'
1481OBJEXT='o'
1482OTOOL64=''
1483OTOOL=''
1484PACKAGE='libltdl'
1485PACKAGE_BUGREPORT='bug-libtool@gnu.org'
1486PACKAGE_NAME='libltdl'
1487PACKAGE_STRING='libltdl 2.4.3a'
1488PACKAGE_TARNAME='libltdl'
1489PACKAGE_URL=''
1490PACKAGE_VERSION='2.4.3a'
1491PATH_SEPARATOR=':'
1492RANLIB='ranlib'
1493SED='/bin/sed'
1494SET_MAKE=''
1495SHELL='/bin/bash'
1496STRIP='strip'
1497VERSION='2.4.3a'
1498ac_ct_AR='ar'
1499ac_ct_CC='gcc'
1500ac_ct_DUMPBIN=''
1501am__EXEEXT_FALSE=''
1502am__EXEEXT_TRUE='#'
1503am__fastdepCC_FALSE=''
1504am__fastdepCC_TRUE='#'
1505am__include='include'
1506am__isrc=''
1507am__leading_dot='.'
1508am__nodep=''
1509am__quote=''
1510am__tar='$${TAR-tar} chof - "$$tardir"'
1511am__untar='$${TAR-tar} xf -'
1512bindir='${exec_prefix}/bin'
1513build='x86_64-pc-linux-gnu'
1514build_alias='x86_64-linux-gnu'
1515build_cpu='x86_64'
1516build_os='linux-gnu'
1517build_vendor='pc'
1518datadir='/usr/share/squid-ssl'
1519datarootdir='${prefix}/share'
1520docdir='${datarootdir}/doc/${PACKAGE_TARNAME}'
1521dvidir='${docdir}'
1522exec_prefix='${prefix}'
1523host='x86_64-pc-linux-gnu'
1524host_alias=''
1525host_cpu='x86_64'
1526host_os='linux-gnu'
1527host_vendor='pc'
1528htmldir='${docdir}'
1529includedir='${prefix}/include'
1530infodir='${prefix}/share/info'
1531install_sh='${SHELL} /media/sdb/svn/xenial/squid-ssl/trunk/fuentes/cfgaux/install-sh'
1532libdir='${exec_prefix}/lib'
1533libexecdir='/usr/lib/squid-ssl'
1534localedir='${datarootdir}/locale'
1535localstatedir='/var'
1536mandir='/usr/share/man'
1537mkdir_p='$(MKDIR_P)'
1538oldincludedir='/usr/include'
1539pdfdir='${docdir}'
1540prefix='/usr'
1541program_transform_name='s&$$&-ssl&'
1542psdir='${docdir}'
1543runstatedir='${localstatedir}/run'
1544sbindir='${exec_prefix}/sbin'
1545sharedstatedir='${prefix}/com'
1546sys_symbol_underscore='no'
1547sysconfdir='/etc/squid-ssl'
1548target_alias=''
1549
1550## ----------- ##
1551## confdefs.h. ##
1552## ----------- ##
1553
1554/* confdefs.h */
1555#define PACKAGE_NAME "libltdl"
1556#define PACKAGE_TARNAME "libltdl"
1557#define PACKAGE_VERSION "2.4.3a"
1558#define PACKAGE_STRING "libltdl 2.4.3a"
1559#define PACKAGE_BUGREPORT "bug-libtool@gnu.org"
1560#define PACKAGE_URL ""
1561#define PACKAGE "libltdl"
1562#define VERSION "2.4.3a"
1563#define STDC_HEADERS 1
1564#define HAVE_SYS_TYPES_H 1
1565#define HAVE_SYS_STAT_H 1
1566#define HAVE_STDLIB_H 1
1567#define HAVE_STRING_H 1
1568#define HAVE_MEMORY_H 1
1569#define HAVE_STRINGS_H 1
1570#define HAVE_INTTYPES_H 1
1571#define HAVE_STDINT_H 1
1572#define HAVE_UNISTD_H 1
1573#define HAVE_DLFCN_H 1
1574#define LT_OBJDIR ".libs/"
1575#define LT_MODULE_EXT ".so"
1576#define LT_MODULE_PATH_VAR "LD_LIBRARY_PATH"
1577#define LT_DLSEARCH_PATH "/lib:/usr/lib:/usr/lib/x86_64-linux-gnu/libfakeroot:/lib/i386-linux-gnu:/usr/lib/i386-linux-gnu:/lib/i686-linux-gnu:/usr/lib/i686-linux-gnu:/usr/local/lib:/lib/x86_64-linux-gnu:/usr/lib/x86_64-linux-gnu:/usr/lib/x86_64-linux-gnu/mesa-egl:/usr/lib/x86_64-linux-gnu/mesa"
1578#define HAVE_LIBDL 1
1579#define HAVE_DLERROR 1
1580#define HAVE_LIBDLLOADER 1
1581#define HAVE_ARGZ_H 1
1582#define HAVE_ERROR_T 1
1583#define HAVE_ARGZ_ADD 1
1584#define HAVE_ARGZ_APPEND 1
1585#define HAVE_ARGZ_COUNT 1
1586#define HAVE_ARGZ_CREATE_SEP 1
1587#define HAVE_ARGZ_INSERT 1
1588#define HAVE_ARGZ_NEXT 1
1589#define HAVE_ARGZ_STRINGIFY 1
1590#define HAVE_WORKING_ARGZ 1
1591#define HAVE_PRELOADED_SYMBOLS 1
1592#define HAVE_UNISTD_H 1
1593#define HAVE_DIRENT_H 1
1594#define HAVE_CLOSEDIR 1
1595#define HAVE_OPENDIR 1
1596#define HAVE_READDIR 1
1597#define LT_LIBEXT "a"
1598#define LT_LIBPREFIX "lib"
1599
1600configure: exit 0
1601
1602## ---------------------- ##
1603## Running config.status. ##
1604## ---------------------- ##
1605
1606This file was extended by libltdl config.status 2.4.3a, which was
1607generated by GNU Autoconf 2.69.  Invocation command line was
1608
1609  CONFIG_FILES    =
1610  CONFIG_HEADERS  =
1611  CONFIG_LINKS    =
1612  CONFIG_COMMANDS =
1613  $ ./config.status
1614
1615on h3po4
1616
1617config.status:1125: creating Makefile
1618config.status:1125: creating config.h
1619config.status:1306: config.h is unchanged
1620config.status:1354: executing depfiles commands
1621config.status:1354: executing libtool commands
1622
1623## ---------------------- ##
1624## Running config.status. ##
1625## ---------------------- ##
1626
1627This file was extended by libltdl config.status 2.4.3a, which was
1628generated by GNU Autoconf 2.69.  Invocation command line was
1629
1630  CONFIG_FILES    =
1631  CONFIG_HEADERS  =
1632  CONFIG_LINKS    =
1633  CONFIG_COMMANDS =
1634  $ ./config.status config.h
1635
1636on h3po4
1637
1638config.status:1125: creating config.h
1639config.status:1306: config.h is unchanged
Note: See TracBrowser for help on using the repository browser.